{"text_format":"1","workbook":"xlsx","n_sheets":15,"sheets":["Cover","Sessionals","Teaching Assistant","Research Assistant","FA- New Hire & Rehire","FA- Changes","AQ Instructors","AT","Format","PM","Work Study","Coaches","AT6H","Casual","Invigilators"],"not_rendered":{"charts":0,"images":2,"macros":1,"external_links":0,"defined_names":1,"comments":0,"pivot_tables":0},"unopened":[],"bounds":{"document_bytes":16777216,"sheet_cells":100000,"rows_first":2000,"rows_last":500,"rows_between":2000,"halvings":0,"cell_chars":16384,"cell_head_chars":4096},"cells_cut":0,"cells_raw":0,"read":"whole","date_system":"1900"}

{"sheet":"Cover","index":0,"n_rows":25,"n_cols":16,"rows_kept":25,"cut":false,"hidden":false,"merged":[[1,1,1,17],[3,2,3,7],[6,3,6,4],[6,8,6,9],[10,3,11,8],[8,11,8,12],[9,11,9,12],[10,11,10,12],[11,11,11,12],[12,11,12,12],[13,3,14,8],[18,3,19,8],[20,3,21,8],[13,11,13,12],[14,11,14,12],[15,11,15,12],[16,11,16,12],[17,11,17,12]]}
[]
[null,"HUMAN RESOURCES - MASS UPLOAD"]
[]
[null,null,"Mass Upload - Data Template"]
[]
[]
[null,null,null,"Banner Login",null,"OTMGR4",null,null,"Contract Type",null,"SS",null,"Date","2023-11-09",null,{"$f":"CONCATENATE(F7,\"_\",K7,\"_\",TEXT(N7, \"YYYYMMDD\"))","v":"OTMGR4_SS_20231109"}]
[]
[null,null,"Instructions for using the speadsheet",null,null,null,null,null,null,null,"Code","Contract"]
[null,null,null,null,null,null,null,null,null,null,"CA","Casuals"]
[null,null,"Step 1 ","In Cover Page Enter your Banner Login(eg : ADM24), Contract Type, Date. When Contract Type is entered that Tab will be highlighted",null,null,null,null,null,null,"CO","Coaches","Coaches"]
[null,null,null,null,null,null,null,null,null,null,"FA","FA- New Hire & Rehire","FA- New Hire & Rehire"]
[null,null,"Step 2","Go to highlighted tab(Contract Type)",null,null,null,null,null,null,"FC","FA- Changes","FA- Changes"]
[null,null,"Step 3","Some data validations are applied for each field. Enter data as per instructions for each cell.",null,null,null,null,null,null,"IN","Invigilators","Invigilators"]
[null,null,null,null,null,null,null,null,null,null,"RA","Research Assistants","Research Assistants"]
[null,null,"Step 4","Some entries are already in the sheet. Remove/Overwrite these example fields.",null,null,null,null,null,null,"SS","Sessionals","Sessionals"]
[null,null,"Step 5","Make sure all the entries are accurate before saving the file.",null,null,null,null,null,null,"TA","Teaching Assistants","Teaching Assistants"]
[null,null,"Step 6","Do not change any fields in Row 1 and Row 2(Header fields)",null,null,null,null,null,null,"WS","Work Study","Work Study"]
[null,null,"Step 7 ","You need separate file for each contract type. When all the entries for the contract type are entered return back to Cover Page"]
[null,null,null,null,null,null,null,null,null,null,"Confirm You are an EPAF user and added to the Approval Queue"]
{"$rows_left_out":6}
{"sheet":"Sessionals","index":1,"n_rows":4,"n_cols":42,"rows_kept":4,"cut":false,"hidden":false,"merged":[]}
["Sessionals"]
["EFFECTIVE DATE",null,"BANNER ID","POSN","SPBPERS_SEX","SPBPERS_SSN","SPBPERS_BIRTH_DATE","SPBPERS_CITZ_CODE","PEBEMPL_CURRENT_HIRE_DATE","NBRBJOB_CONTRACT_BEGIN_DATE","NBRBJOB_CONTRACT_END_DATE","NBRJOBS_ANN_SALARY","NBRJOBS_CONTRACT_NO","NBRJOBS_FTE","NBRJLBD_COAS_CODE","NBRJLBD_FUND_CODE","NBRJLBD_ORGN_CODE","NBRJLBD_ACCT_CODE","NBRJLBD_PROG_CODE","NBRJLBD_ACTV_CODE","NBRJLBD_PERCENT","NBRJLBD_COAS_CODE","NBRJLBD_FUND_CODE","NBRJLBD_ORGN_CODE","NBRJLBD_ACCT_CODE","NBRJLBD_PROG_CODE","NBRJLBD_ACTV_CODE","NBRJLBD_PERCENT","NBRJLBD_COAS_CODE","NBRJLBD_FUND_CODE","NBRJLBD_ORGN_CODE","NBRJLBD_ACCT_CODE","NBRJLBD_PROG_CODE","NBRJLBD_ACTV_CODE","NBRJLBD_PERCENT","NBRJLBD_COAS_CODE","NBRJLBD_FUND_CODE","NBRJLBD_ORGN_CODE","NBRJLBD_ACCT_CODE","NBRJLBD_PROG_CODE","NBRJLBD_ACTV_CODE","NBRJLBD_PERCENT"]
["EFFECTIVE DATE","Rehire","BANNER ID","POSN","Sex","SSN/SIN/TIN","Birth Date","Citizenship","Current Hire Date","Contract Begin Date","Contract End Date","Contract/Annual Pay","Course code","Number of sections","COA Code","Fund Code","Organization Code","Account Code","Program Code","Activity Code","Percent","COA Code","Fund Code","Organization Code","Account Code","Program Code","Activity Code","Percent","COA Code","Fund Code","Organization Code","Account Code","Program Code","Activity Code","Percent","COA Code","Fund Code","Organization Code","Account Code","Program Code","Activity Code","Percent"]
["2024-01-08","No",123456789,"IN0090","M",555666777,"1988-06-11","Canadian","2024-01-08","2024-01-08","2024-01-09",8500,"BUSI1520U",null,"U",100000,3504,62065,null,null,100]

{"sheet":"Teaching Assistant","index":2,"n_rows":4,"n_cols":43,"rows_kept":4,"cut":false,"hidden":true,"merged":[]}
["Teaching Assistant"]
["EFFECTIVE DATE","BANNER ID","POSN","SPBPERS_SEX","SPBPERS_SSN","SPBPERS_BIRTH_DATE","SPBPERS_CITZ_CODE","PEBEMPL_CURRENT_HIRE_DATE","NBRBJOB_CONTRACT_BEGIN_DATE","NBRBJOB_CONTRACT_END_DATE","NBRBJOB_TOTAL_CONTRACT_HRS","NBRJOBS_HRS_PAY","NBRJOBS_REG_RATE","NBRJOBS_CONTRACT_NO","NBRJOBS_FTE","NBRJLBD_COAS_CODE","NBRJLBD_FUND_CODE","NBRJLBD_ORGN_CODE","NBRJLBD_ACCT_CODE","NBRJLBD_PROG_CODE","NBRJLBD_ACTV_CODE","NBRJLBD_PERCENT","NBRJLBD_COAS_CODE","NBRJLBD_FUND_CODE","NBRJLBD_ORGN_CODE","NBRJLBD_ACCT_CODE","NBRJLBD_PROG_CODE","NBRJLBD_ACTV_CODE","NBRJLBD_PERCENT","NBRJLBD_COAS_CODE","NBRJLBD_FUND_CODE","NBRJLBD_ORGN_CODE","NBRJLBD_ACCT_CODE","NBRJLBD_PROG_CODE","NBRJLBD_ACTV_CODE","NBRJLBD_PERCENT","NBRJLBD_COAS_CODE","NBRJLBD_FUND_CODE","NBRJLBD_ORGN_CODE","NBRJLBD_ACCT_CODE","NBRJLBD_PROG_CODE","NBRJLBD_ACTV_CODE","NBRJLBD_PERCENT"]
["EFFECTIVE DATE","BANNER ID","POSN","Sex","SSN/SIN/TIN","Birth Date","Citizenship","Current Hire Date","Contract Begin Date","Contract End Date","Total Contract Hrs","Hours per Pay(2 wks)","Regular Rate","CRN Course code","Number of sections","COA Code","Fund Code","Organization Code","Account Code","Program Code","Activity Code","Percent","COA Code","Fund Code","Organization Code","Account Code","Program Code","Activity Code","Percent","COA Code","Fund Code","Organization Code","Account Code","Program Code","Activity Code","Percent","COA Code","Fund Code","Organization Code","Account Code","Program Code","Activity Code","Percent"]
["2023-09-06",100818769,"5TG939",null,null,null,null,"2023-12-21","2023-12-22","2023-12-23",140,null,30,"MATH 1000U",1,"U",100000,2700,62020,null,null,100]

{"sheet":"Research Assistant","index":3,"n_rows":4,"n_cols":41,"rows_kept":4,"cut":false,"hidden":true,"merged":[]}
["Research Assistant"]
["EFFECTIVE DATE",null,"BANNER ID","POSN","SPBPERS_SEX","SPBPERS_SSN","SPBPERS_BIRTH_DATE","SPBPERS_CITZ_CODE","PEBEMPL_CURRENT_HIRE_DATE","NBRBJOB_CONTRACT_BEGIN_DATE","NBRBJOB_CONTRACT_END_DATE","NBRJOBS_HRS_PAY","NBRJOBS_REG_RATE","NBRJLBD_COAS_CODE","NBRJLBD_FUND_CODE","NBRJLBD_ORGN_CODE","NBRJLBD_ACCT_CODE","NBRJLBD_PROG_CODE","NBRJLBD_ACTV_CODE","NBRJLBD_PERCENT","NBRJLBD_COAS_CODE","NBRJLBD_FUND_CODE","NBRJLBD_ORGN_CODE","NBRJLBD_ACCT_CODE","NBRJLBD_PROG_CODE","NBRJLBD_ACTV_CODE","NBRJLBD_PERCENT","NBRJLBD_COAS_CODE","NBRJLBD_FUND_CODE","NBRJLBD_ORGN_CODE","NBRJLBD_ACCT_CODE","NBRJLBD_PROG_CODE","NBRJLBD_ACTV_CODE","NBRJLBD_PERCENT","NBRJLBD_COAS_CODE","NBRJLBD_FUND_CODE","NBRJLBD_ORGN_CODE","NBRJLBD_ACCT_CODE","NBRJLBD_PROG_CODE","NBRJLBD_ACTV_CODE","NBRJLBD_PERCENT"]
["EFFECTIVE DATE","Rehire","BANNER ID","POSN","Sex","SSN/SIN/TIN","Birth Date","Citizenship","Current Hire Date","Contract Begin Date","Contract End Date","Total Contract Hrs","Regular Rate","COA Code","Fund Code","Organization Code","Account Code","Program Code","Activity Code","Percent","COA Code","Fund Code","Organization Code","Account Code","Program Code","Activity Code","Percent","COA Code","Fund Code","Organization Code","Account Code","Program Code","Activity Code","Percent","COA Code","Fund Code","Organization Code","Account Code","Program Code","Activity Code","Percent"]
["2023-06-01","Yes",123456789,"IN0090",null,null,null,null,"2023-06-01","2023-06-02","2023-06-03",null,30,"U",100000,3504,62065,null,null,null,null,null,null,null,null,null,null,"U",100000,3504,62065]

{"sheet":"FA- New Hire & Rehire","index":4,"n_rows":4,"n_cols":39,"rows_kept":4,"cut":false,"hidden":true,"merged":[]}
["FA- New Hire & Rehire"]
["EFFECTIVE DATE",null,"BANNER ID","POSN","SPBPERS_SEX","SPBPERS_SSN","SPBPERS_BIRTH_DATE","SPBPERS_CITZ_CODE","PEBEMPL_CURRENT_HIRE_DATE","NBRBJOB_CONTRACT_BEGIN_DATE","NBRBJOB_CONTRACT_END_DATE","NBRJLBD_COAS_CODE","NBRJLBD_FUND_CODE","NBRJLBD_ORGN_CODE","NBRJLBD_ACCT_CODE","NBRJLBD_PROG_CODE","NBRJLBD_ACTV_CODE","NBRJLBD_PERCENT","NBRJLBD_COAS_CODE","NBRJLBD_FUND_CODE","NBRJLBD_ORGN_CODE","NBRJLBD_ACCT_CODE","NBRJLBD_PROG_CODE","NBRJLBD_ACTV_CODE","NBRJLBD_PERCENT","NBRJLBD_COAS_CODE","NBRJLBD_FUND_CODE","NBRJLBD_ORGN_CODE","NBRJLBD_ACCT_CODE","NBRJLBD_PROG_CODE","NBRJLBD_ACTV_CODE","NBRJLBD_PERCENT","NBRJLBD_COAS_CODE","NBRJLBD_FUND_CODE","NBRJLBD_ORGN_CODE","NBRJLBD_ACCT_CODE","NBRJLBD_PROG_CODE","NBRJLBD_ACTV_CODE","NBRJLBD_PERCENT"]
["EFFECTIVE DATE","Rehire","BANNER ID","POSN","Sex","SSN/SIN/TIN","Birth Date","Citizenship","Current Hire Date","Contract Begin Date","Contract End Date","COA Code","Fund Code","Organization Code","Account Code","Program Code","Activity Code","Percent","COA Code","Fund Code","Organization Code","Account Code","Program Code","Activity Code","Percent","COA Code","Fund Code","Organization Code","Account Code","Program Code","Activity Code","Percent","COA Code","Fund Code","Organization Code","Account Code","Program Code","Activity Code","Percent"]
["2023-05-05","Yes",123456789,"IN0090","M",555666777,"1988-06-11","Canadian","2023-05-05","2023-05-05","2023-05-05","U",100000,3504,62065,null,null,100,null,null,null,null,null,null,null,"U",100000,3504,62065]

{"sheet":"FA- Changes","index":5,"n_rows":4,"n_cols":41,"rows_kept":4,"cut":false,"hidden":true,"merged":[]}
["FA- Changes"]
["EFFECTIVE DATE",null,"BANNER ID","POSN","SPBPERS_SEX","SPBPERS_SSN","SPBPERS_BIRTH_DATE","SPBPERS_CITZ_CODE","PEBEMPL_CURRENT_HIRE_DATE","NBRBJOB_CONTRACT_BEGIN_DATE","NBRBJOB_CONTRACT_END_DATE",null,null,"NBRJLBD_COAS_CODE","NBRJLBD_FUND_CODE","NBRJLBD_ORGN_CODE","NBRJLBD_ACCT_CODE","NBRJLBD_PROG_CODE","NBRJLBD_ACTV_CODE","NBRJLBD_PERCENT","NBRJLBD_COAS_CODE","NBRJLBD_FUND_CODE","NBRJLBD_ORGN_CODE","NBRJLBD_ACCT_CODE","NBRJLBD_PROG_CODE","NBRJLBD_ACTV_CODE","NBRJLBD_PERCENT","NBRJLBD_COAS_CODE","NBRJLBD_FUND_CODE","NBRJLBD_ORGN_CODE","NBRJLBD_ACCT_CODE","NBRJLBD_PROG_CODE","NBRJLBD_ACTV_CODE","NBRJLBD_PERCENT","NBRJLBD_COAS_CODE","NBRJLBD_FUND_CODE","NBRJLBD_ORGN_CODE","NBRJLBD_ACCT_CODE","NBRJLBD_PROG_CODE","NBRJLBD_ACTV_CODE","NBRJLBD_PERCENT"]
["EFFECTIVE DATE","Rehire","BANNER ID","POSN","Sex","SSN/SIN/TIN","Birth Date","Citizenship","Current Hire Date","Contract Begin Date","Contract End Date","Hourly Rate","Number of Students","COA Code","Fund Code","Organization Code","Account Code","Program Code","Activity Code","Percent","COA Code","Fund Code","Organization Code","Account Code","Program Code","Activity Code","Percent","COA Code","Fund Code","Organization Code","Account Code","Program Code","Activity Code","Percent","COA Code","Fund Code","Organization Code","Account Code","Program Code","Activity Code","Percent"]
["2023-05-05","Yes",123456789,"IN0090","M",555666777,"1988-06-11","Canadian","2023-06-04","2023-06-05","2023-06-06",null,null,"U",100000,3504,62065,null,null,100,null,null,null,null,null,null,null,"U",100000,3504,62065]

{"sheet":"AQ Instructors","index":6,"n_rows":4,"n_cols":40,"rows_kept":4,"cut":false,"hidden":true,"merged":[]}
["AQ Instructors"]
["EFFECTIVE DATE",null,"BANNER ID","POSN","SPBPERS_SEX","SPBPERS_SSN","SPBPERS_BIRTH_DATE","SPBPERS_CITZ_CODE","PEBEMPL_CURRENT_HIRE_DATE","NBRBJOB_CONTRACT_BEGIN_DATE","NBRBJOB_CONTRACT_END_DATE",null,"NBRJLBD_COAS_CODE","NBRJLBD_FUND_CODE","NBRJLBD_ORGN_CODE","NBRJLBD_ACCT_CODE","NBRJLBD_PROG_CODE","NBRJLBD_ACTV_CODE","NBRJLBD_PERCENT","NBRJLBD_COAS_CODE","NBRJLBD_FUND_CODE","NBRJLBD_ORGN_CODE","NBRJLBD_ACCT_CODE","NBRJLBD_PROG_CODE","NBRJLBD_ACTV_CODE","NBRJLBD_PERCENT","NBRJLBD_COAS_CODE","NBRJLBD_FUND_CODE","NBRJLBD_ORGN_CODE","NBRJLBD_ACCT_CODE","NBRJLBD_PROG_CODE","NBRJLBD_ACTV_CODE","NBRJLBD_PERCENT","NBRJLBD_COAS_CODE","NBRJLBD_FUND_CODE","NBRJLBD_ORGN_CODE","NBRJLBD_ACCT_CODE","NBRJLBD_PROG_CODE","NBRJLBD_ACTV_CODE","NBRJLBD_PERCENT"]
["EFFECTIVE DATE","Rehire","BANNER ID","POSN","Sex","SSN/SIN/TIN","Birth Date","Citizenship","Current Hire Date","Contract Begin Date","Contract End Date","Pay Type","COA Code","Fund Code","Organization Code","Account Code","Program Code","Activity Code","Percent","COA Code","Fund Code","Organization Code","Account Code","Program Code","Activity Code","Percent","COA Code","Fund Code","Organization Code","Account Code","Program Code","Activity Code","Percent","COA Code","Fund Code","Organization Code","Account Code","Program Code","Activity Code","Percent"]
["2023-05-05","Yes",123456789,"IN0090","M",555666777,"1988-06-11","Canadian","2023-05-05","2023-05-05","2023-05-05",null,"U",100000,3504,62065,null,null,100,null,null,null,null,null,null,null,"U",100000,3504,62065]

{"sheet":"AT","index":7,"n_rows":4,"n_cols":40,"rows_kept":4,"cut":false,"hidden":true,"merged":[]}
["AT"]
["EFFECTIVE DATE",null,"BANNER ID","POSN","SPBPERS_SEX","SPBPERS_SSN","SPBPERS_BIRTH_DATE","SPBPERS_CITZ_CODE","SPBPERS_CITZ_CODE","PEBEMPL_CURRENT_HIRE_DATE","NBRBJOB_CONTRACT_BEGIN_DATE","NBRBJOB_CONTRACT_END_DATE",null,null,null,"NBRJLBD_COAS_CODE","NBRJLBD_FUND_CODE","NBRJLBD_ORGN_CODE","NBRJLBD_ACCT_CODE","NBRJLBD_PROG_CODE","NBRJLBD_ACTV_CODE","NBRJLBD_PERCENT","NBRJLBD_COAS_CODE","NBRJLBD_FUND_CODE","NBRJLBD_ORGN_CODE","NBRJLBD_ACCT_CODE","NBRJLBD_PROG_CODE","NBRJLBD_PERCENT","NBRJLBD_COAS_CODE","NBRJLBD_FUND_CODE","NBRJLBD_ORGN_CODE","NBRJLBD_ACCT_CODE","NBRJLBD_PROG_CODE","NBRJLBD_PERCENT","NBRJLBD_COAS_CODE","NBRJLBD_FUND_CODE","NBRJLBD_ORGN_CODE","NBRJLBD_ACCT_CODE","NBRJLBD_PROG_CODE","NBRJLBD_PERCENT"]
["EFFECTIVE DATE","Rehire","BANNER ID","POSN","Sex","SSN/SIN/TIN","Birth Date","Citizenship","Code","Current Hire Date","Contract Begin Date","Contract End Date","Contract/Annual Pay","CRN Course code","Number of sections","COA Code","Fund Code","Organization Code","Account Code","Program Code","Activity Code","Percent","COA Code","Fund Code","Organization Code","Account Code","Program Code","Percent","COA Code","Fund Code","Organization Code","Account Code","Program Code","Percent","COA Code","Fund Code","Organization Code","Account Code","Program Code","Percent"]
["2023-05-05","Yes",123456789,"IN0090","M",555666777,"1988-06-11","Canadian",{"$f":"VLOOKUP(H4,Format!I:J,2,0)","v":27},"2023-06-04","2023-06-05","2023-06-06",7717,"BUSI1450",null,"U",100000,3504,62065,null,null,100]

{"sheet":"Format","index":8,"n_rows":2011,"n_cols":16,"rows_kept":2011,"cut":false,"hidden":true,"merged":[]}
["Sex",null,"COURSE/CRN code","FTE","COA Code",null,null,null,"Country","code","Code","Contract"]
["M","10581",{"$f":"CONCATENATE(B2,\"U\")","v":"10581U"},1,null,null,null,null,"Canadian",27,"AQ",null,null,null,"Standard",8029]
["F","40722",{"$f":"CONCATENATE(B3,\"U\")","v":"40722U"},78,"C",null,null,null,"US",12,"AT",null,null,null,"Prem A",8634]
["X","40722","40722U",78,"U",null,null,null,"Other",23,"CA","Casuals",null,null,"Prem B",9180]
[null,"4UI959","4UI959U",26,"U",null,null,null,null,null,"CO","Coaches"]
[null,"4UI959","4UI959U",26,"C",null,null,null,null,null,"FA","FA- New Hire & Rehire"]
[null,"AEDT1110","AEDT1110U",318,"U",null,null,null,null,null,"FC","FA- Changes"]
[null,"AEDT1110","AEDT1110U",318,"C",null,null,null,null,null,"IN","Invigilators"]
[null,"AEDT1120","AEDT1120U",111,"U",null,null,null,null,null,"PM"]
[null,"AEDT1120","AEDT1120U",111,"C",null,null,null,null,null,"RA","Research Assistants"]
[null,"AEDT1160","AEDT1160U",1,null,null,null,null,null,null,"SS","Sessionals"]
[null,"AEDT1160","AEDT1160U",15,"C",null,null,null,null,null,"TA","Teaching Assistants"]
[null,"AEDT1160","AEDT1160U",15,"U",null,null,null,null,null,"WL"]
[null,"AEDT1170","AEDT1170U",1,null,null,null,null,null,null,"WS","Work Study"]
[null,"AEDT2120","AEDT2120U",3]
[null,"AEDT2130","AEDT2130U",30,"C"]
[null,"AEDT2130","AEDT2130U",30,"U"]
[null,"AEDT2130","AEDT2130U",1]
[null,"AEDT2150","AEDT2150U",15,"C"]
[null,"AEDT2150","AEDT2150U",15,"U"]
{"$rows_left_out":1992}
{"sheet":"PM","index":9,"n_rows":4,"n_cols":40,"rows_kept":4,"cut":false,"hidden":true,"merged":[]}
["PM"]
["EFFECTIVE DATE",null,"BANNER ID","POSN","SPBPERS_SEX","SPBPERS_SSN","SPBPERS_BIRTH_DATE","SPBPERS_CITZ_CODE","SPBPERS_CITZ_CODE","PEBEMPL_CURRENT_HIRE_DATE","NBRBJOB_CONTRACT_BEGIN_DATE","NBRBJOB_CONTRACT_END_DATE",null,null,null,"NBRJLBD_COAS_CODE","NBRJLBD_FUND_CODE","NBRJLBD_ORGN_CODE","NBRJLBD_ACCT_CODE","NBRJLBD_PROG_CODE","NBRJLBD_ACTV_CODE","NBRJLBD_PERCENT","NBRJLBD_COAS_CODE","NBRJLBD_FUND_CODE","NBRJLBD_ORGN_CODE","NBRJLBD_ACCT_CODE","NBRJLBD_PROG_CODE","NBRJLBD_PERCENT","NBRJLBD_COAS_CODE","NBRJLBD_FUND_CODE","NBRJLBD_ORGN_CODE","NBRJLBD_ACCT_CODE","NBRJLBD_PROG_CODE","NBRJLBD_PERCENT","NBRJLBD_COAS_CODE","NBRJLBD_FUND_CODE","NBRJLBD_ORGN_CODE","NBRJLBD_ACCT_CODE","NBRJLBD_PROG_CODE","NBRJLBD_PERCENT"]
["EFFECTIVE DATE","Rehire","BANNER ID","POSN","Sex","SSN/SIN/TIN","Birth Date","Citizenship","Code","Current Hire Date","Contract Begin Date","Contract End Date","Contract/Annual Pay","CRN Course code","Number of sections","COA Code","Fund Code","Organization Code","Account Code","Program Code","Activity Code","Percent","COA Code","Fund Code","Organization Code","Account Code","Program Code","Percent","COA Code","Fund Code","Organization Code","Account Code","Program Code","Percent","COA Code","Fund Code","Organization Code","Account Code","Program Code","Percent"]
["2023-05-05","Yes",123456789,"IN0090","M",555666777,"1988-06-11","Canadian",{"$f":"VLOOKUP(H4,Format!I:J,2,0)","v":27},"2023-05-05","2023-05-06","2023-05-07",7717,"BUSI1450",null,"U",100000,3504,62065,null,null,100]

{"sheet":"Work Study","index":10,"n_rows":4,"n_cols":12,"rows_kept":4,"cut":false,"hidden":true,"merged":[]}
["Work Study"]
["EFFECTIVE DATE",null,"BANNER ID","POSN","SPBPERS_SSN","PEBEMPL_CURRENT_HIRE_DATE","SUP_ID","NBRJOBS_DESC","NBRJOBS_ORGN_CODE_TS","NBRBJOB_CONTRACT_BEGIN_DATE","NBRBJOB_CONTRACT_END_DATE","NBRJOBS_REG_RATE"]
["EFFECTIVE DATE","Rehire","BANNER ID","POSN","SSN/SIN/TIN","Current Hire Date","Supervisor ID","Title","Timesheet Org","Contract Begin Date","Contract End Date","Hourly Rate"]
["2023-08-23","Yes",555444666,"IN0090",555666777,"2023-08-23",null,null,null,"2023-08-23","2023-08-24"]

{"sheet":"Coaches","index":11,"n_rows":4,"n_cols":46,"rows_kept":4,"cut":false,"hidden":true,"merged":[]}
["COACHES - HIRE/REHIRE"]
["EFFECTIVE DATE",null,"BANNER ID","POSN","SPBPERS_SEX","SPBPERS_SSN","SPBPERS_BIRTH_DATE","SPBPERS_CITZ_CODE","PEBEMPL_CURRENT_HIRE_DATE","NBRBJOB_CONTRACT_BEGIN_DATE","NBRBJOB_CONTRACT_END_DATE","NBRJOBS_EFFECTIVE_DATE","NBRJOBS_EFFECTIVE_DATE","NBRJOBS_EFFECTIVE_DATE","NBRJOBS_EFFECTIVE_DATE","NBRJOBS_ANN_SALARY","NBRJOBS_DESC","SUP_ID","NBRJLBD_COAS_CODE","NBRJLBD_FUND_CODE","NBRJLBD_ORGN_CODE","NBRJLBD_ACCT_CODE","NBRJLBD_PROG_CODE","NBRJLBD_ACTV_CODE","NBRJLBD_PERCENT","NBRJLBD_COAS_CODE","NBRJLBD_FUND_CODE","NBRJLBD_ORGN_CODE","NBRJLBD_ACCT_CODE","NBRJLBD_PROG_CODE","NBRJLBD_ACTV_CODE","NBRJLBD_PERCENT","NBRJLBD_COAS_CODE","NBRJLBD_FUND_CODE","NBRJLBD_ORGN_CODE","NBRJLBD_ACCT_CODE","NBRJLBD_PROG_CODE","NBRJLBD_ACTV_CODE","NBRJLBD_PERCENT","NBRJLBD_COAS_CODE","NBRJLBD_FUND_CODE","NBRJLBD_ORGN_CODE","NBRJLBD_ACCT_CODE","NBRJLBD_PROG_CODE","NBRJLBD_ACTV_CODE","NBRJLBD_PERCENT"]
["EFFECTIVE DATE","Rehire","BANNER ID","POSN","Sex","SSN/SIN/TIN","Birth Date","Citizenship","Current Hire Date","Contract Begin Date","Contract End Date","First Pay Begin ","First Pay End","Second Pay Begin","Second Pay End","Annual Salary","Job Description","SUP ID","COA Code","Fund Code","Organization Code","Account Code","Program Code","Activity Code","Percent","COA Code","Fund Code","Organization Code","Account Code","Program Code","Activity Code","Percent","COA Code","Fund Code","Organization Code","Account Code","Program Code","Activity Code","Percent","COA Code","Fund Code","Organization Code","Account Code","Program Code","Activity Code","Percent"]
["2023-09-05","Yes",100285956,"IN0090","M",555666777,"1988-06-11","Canadian","2023-09-05","2023-09-05","2023-09-05","2023-09-05","2023-09-05","2023-09-05","2023-09-05",2000,"COACH",100033448,"U",100000,3504,62065,null,null,100,null,null,null,null,null,null,null,"U",100000,3504,62065]

{"sheet":"AT6H","index":12,"n_rows":4,"n_cols":40,"rows_kept":4,"cut":false,"hidden":true,"merged":[]}
["AT6H"]
["EFFECTIVE DATE",null,"BANNER ID","POSN","SPBPERS_SEX","SPBPERS_SSN","SPBPERS_BIRTH_DATE","SPBPERS_CITZ_CODE","SPBPERS_CITZ_CODE","PEBEMPL_CURRENT_HIRE_DATE","NBRBJOB_CONTRACT_BEGIN_DATE","NBRBJOB_CONTRACT_END_DATE",null,null,null,"NBRJLBD_COAS_CODE","NBRJLBD_FUND_CODE","NBRJLBD_ORGN_CODE","NBRJLBD_ACCT_CODE","NBRJLBD_PROG_CODE","NBRJLBD_ACTV_CODE","NBRJLBD_PERCENT","NBRJLBD_COAS_CODE","NBRJLBD_FUND_CODE","NBRJLBD_ORGN_CODE","NBRJLBD_ACCT_CODE","NBRJLBD_PROG_CODE","NBRJLBD_PERCENT","NBRJLBD_COAS_CODE","NBRJLBD_FUND_CODE","NBRJLBD_ORGN_CODE","NBRJLBD_ACCT_CODE","NBRJLBD_PROG_CODE","NBRJLBD_PERCENT","NBRJLBD_COAS_CODE","NBRJLBD_FUND_CODE","NBRJLBD_ORGN_CODE","NBRJLBD_ACCT_CODE","NBRJLBD_PROG_CODE","NBRJLBD_PERCENT"]
["EFFECTIVE DATE","Rehire","BANNER ID","POSN","Sex","SSN/SIN/TIN","Birth Date","Citizenship","Code","Current Hire Date","Contract Begin Date","Contract End Date","Contract/Annual Pay","CRN Course code","Number of sections","COA Code","Fund Code","Organization Code","Account Code","Program Code","Activity Code","Percent","COA Code","Fund Code","Organization Code","Account Code","Program Code","Percent","COA Code","Fund Code","Organization Code","Account Code","Program Code","Percent","COA Code","Fund Code","Organization Code","Account Code","Program Code","Percent"]
["2023-05-05","Yes",123456789,"IN0090","M",555666777,"1988-06-11","Canadian",{"$f":"VLOOKUP(H4,Format!I:J,2,0)","v":27},"2023-05-05","2023-05-05","2023-05-05",7717,"AEDT1120U",null,"U",100000,3504,62065,null,null,100]

{"sheet":"Casual","index":13,"n_rows":4,"n_cols":43,"rows_kept":4,"cut":false,"hidden":true,"merged":[]}
["Casual"]
["EFFECTIVE DATE",null,"BANNER ID","POSN","SPBPERS_SEX","SPBPERS_SSN","SPBPERS_BIRTH_DATE","SPBPERS_CITZ_CODE","PEBEMPL_CURRENT_HIRE_DATE","SUP_ID","NBRBJOB_CONTRACT_BEGIN_DATE","NBRBJOB_CONTRACT_END_DATE","NBRJOBS_REG_RATE","NBRJOBS_ORGN_CODE_TS","NBRJOBS_DESC","NBRJLBD_COAS_CODE","NBRJLBD_FUND_CODE","NBRJLBD_ORGN_CODE","NBRJLBD_ACCT_CODE","NBRJLBD_PROG_CODE","NBRJLBD_ACTV_CODE","NBRJLBD_PERCENT","NBRJLBD_COAS_CODE","NBRJLBD_FUND_CODE","NBRJLBD_ORGN_CODE","NBRJLBD_ACCT_CODE","NBRJLBD_PROG_CODE","NBRJLBD_ACTV_CODE","NBRJLBD_PERCENT","NBRJLBD_COAS_CODE","NBRJLBD_FUND_CODE","NBRJLBD_ORGN_CODE","NBRJLBD_ACCT_CODE","NBRJLBD_PROG_CODE","NBRJLBD_ACTV_CODE","NBRJLBD_PERCENT","NBRJLBD_COAS_CODE","NBRJLBD_FUND_CODE","NBRJLBD_ORGN_CODE","NBRJLBD_ACCT_CODE","NBRJLBD_PROG_CODE","NBRJLBD_ACTV_CODE","NBRJLBD_PERCENT"]
["EFFECTIVE DATE","Rehire","BANNER ID","POSN","Sex","SSN/SIN/TIN","Birth Date","Citizenship","Current Hire Date","SUP ID","Contract Begin Date","Contract End Date","Regular Rate","Timesheet Org Code","Title","COA Code","Fund Code","Organization Code","Account Code","Program Code","Activity Code","Percent","COA Code","Fund Code","Organization Code","Account Code","Program Code","Activity Code","Percent","COA Code","Fund Code","Organization Code","Account Code","Program Code","Activity Code","Percent","COA Code","Fund Code","Organization Code","Account Code","Program Code","Activity Code","Percent"]
["2023-05-05","Yes",123456789,"IN0090","M",555666777,"1988-06-11","Canadian","2023-05-05",null,"2023-05-05","2023-05-05",35.659999999999997,3700,"Invigilator","U",100000,3504,62065,null,null,100,null,null,null,null,null,null,null,"U",100000,3504,62065]

{"sheet":"Invigilators","index":14,"n_rows":4,"n_cols":43,"rows_kept":4,"cut":false,"hidden":true,"merged":[]}
["Invigilators"]
["EFFECTIVE DATE",null,"BANNER ID","POSN","SPBPERS_SEX","SPBPERS_SSN","SPBPERS_BIRTH_DATE","SPBPERS_CITZ_CODE","SPBPERS_CITZ_CODE","PEBEMPL_CURRENT_HIRE_DATE","NBRBJOB_CONTRACT_BEGIN_DATE","NBRBJOB_CONTRACT_END_DATE","NBRJOBS_REG_RATE","NBRJOBS_ORGN_CODE_TS","NBRJOBS_DESC","NBRJLBD_COAS_CODE","NBRJLBD_FUND_CODE","NBRJLBD_ORGN_CODE","NBRJLBD_ACCT_CODE","NBRJLBD_PROG_CODE","NBRJLBD_ACTV_CODE","NBRJLBD_PERCENT","NBRJLBD_COAS_CODE","NBRJLBD_FUND_CODE","NBRJLBD_ORGN_CODE","NBRJLBD_ACCT_CODE","NBRJLBD_PROG_CODE","NBRJLBD_ACTV_CODE","NBRJLBD_PERCENT","NBRJLBD_COAS_CODE","NBRJLBD_FUND_CODE","NBRJLBD_ORGN_CODE","NBRJLBD_ACCT_CODE","NBRJLBD_PROG_CODE","NBRJLBD_ACTV_CODE","NBRJLBD_PERCENT","NBRJLBD_COAS_CODE","NBRJLBD_FUND_CODE","NBRJLBD_ORGN_CODE","NBRJLBD_ACCT_CODE","NBRJLBD_PROG_CODE","NBRJLBD_ACTV_CODE","NBRJLBD_PERCENT"]
["EFFECTIVE DATE","Rehire","BANNER ID","POSN","Sex","SSN/SIN/TIN","Birth Date","Citizenship","Code","Current Hire Date","Contract Begin Date","Contract End Date","Regular Rate","Timesheet Org Code","Title","COA Code","Fund Code","Organization Code","Account Code","Program Code","Activity Code","Percent","COA Code","Fund Code","Organization Code","Account Code","Program Code","Activity Code","Percent","COA Code","Fund Code","Organization Code","Account Code","Program Code","Activity Code","Percent","COA Code","Fund Code","Organization Code","Account Code","Program Code","Activity Code","Percent"]
["2023-05-05","Yes",888888888,"IN0090","M",555666777,"1988-06-11","Canadian",{"$f":"VLOOKUP(H4,Format!I:J,2,0)","v":27},"2023-06-04","2023-06-05","2023-06-06",35.659999999999997,3700,"Invigilator","U",100000,3504,62065,null,null,100,null,null,null,null,null,null,null,"U",100000,3504,62065]