{"text_format":"1","workbook":"xlsx","n_sheets":3,"sheets":["JV","FUND","ORGN"],"not_rendered":{"charts":0,"images":2,"macros":0,"external_links":1,"defined_names":2,"comments":0,"pivot_tables":0},"unopened":[],"bounds":{"document_bytes":16777216,"sheet_cells":100000,"rows_first":2000,"rows_last":500,"rows_between":2000,"halvings":0,"cell_chars":16384,"cell_head_chars":4096},"cells_cut":0,"cells_raw":0,"read":"whole","date_system":"1900"}

{"sheet":"JV","index":0,"n_rows":81,"n_cols":14,"rows_kept":81,"cut":false,"hidden":false,"merged":[]}
[]
[null,null,null,null,null,null,null,null,"Finance"]
[null,null,null,null,null,null,null,null,"JOURNAL VOUCHER",null,null,null,null,"INTEGRATED SERVICES"]
[]
[]
[null,null,null,null,null,null,null,null,null,null,null,null,null,"TREASURY"]
[null,"**JV NUMBER:",null,null,null,null,null,null,null,null,"**POSTING DATE:"]
[null,null,null,null,null,null,null,null,null,null,null,"(MM/DD/YYYY)"]
[null,"**REFERENCE JV:"]
[]
[null,"**JOURNAL TYPE:",null,null,null,null,null,null,null,null,"FISCAL PERIOD:"]
[]
[null,"**REV JV NUMBER:",null,null,null,null,null,null,null,null,"FISCAL YEAR:","2019 - 20"]
[]
[null,"Correction: ",null,null,null,null,null,null,null,null,"REVERSING DATE:"]
[null,"**DESCRIPTION:"]
[]
["JE#","Ref","Activity Code","FUND","Fund Prog Code","ORG","ACCOUNT","PROGRAM","ACCOUNT DESCRIPTION","DEBIT","CREDIT","JOURNAL DETAILS"]
[null,null,null,null,{"$f":"_xlfn.IFNA(IFERROR(VLOOKUP($D19,[1]FUND1!$A:$C,3,FALSE),VLOOKUP($D19,[1]FUND1!$A:$C,3,FALSE)),\"\")","v":""},null,null,{"$f":"_xlfn.IFNA(IF(E19=\"ORG\",VLOOKUP(F19,[1]ORG!$A:$C,3,FALSE), E19),\"\")","v":""},{"$f":"IF(G19<=0,\" \",VLOOKUP(G19,[1]Accounts!$A:$B,2,FALSE))","v":" "}]
[null,null,null,null,{"$f":"_xlfn.IFNA(IFERROR(VLOOKUP($D20,[1]FUND1!$A:$C,3,FALSE),VLOOKUP($D20,[1]FUND1!$A:$C,3,FALSE)),\"\")","v":""},null,null,{"$f":"_xlfn.IFNA(IF(E20=\"ORG\",VLOOKUP(F20,[1]ORG!$A:$C,3,FALSE), E20),\"\")","v":""},{"$f":"IF(G20<=0,\" \",VLOOKUP(G20,[1]Accounts!$A:$B,2,FALSE))","v":" "}]
[null,null,null,null,{"$f":"_xlfn.IFNA(IFERROR(VLOOKUP($D21,[1]FUND1!$A:$C,3,FALSE),VLOOKUP($D21,[1]FUND1!$A:$C,3,FALSE)),\"\")","v":""},null,null,{"$f":"_xlfn.IFNA(IF(E21=\"ORG\",VLOOKUP(F21,[1]ORG!$A:$C,3,FALSE), E21),\"\")","v":""},{"$f":"IF(G21<=0,\" \",VLOOKUP(G21,[1]Accounts!$A:$B,2,FALSE))","v":" "}]
[null,null,null,null,{"$f":"_xlfn.IFNA(IFERROR(VLOOKUP($D22,[1]FUND1!$A:$C,3,FALSE),VLOOKUP($D22,[1]FUND1!$A:$C,3,FALSE)),\"\")","v":""},null,null,{"$f":"_xlfn.IFNA(IF(E22=\"ORG\",VLOOKUP(F22,[1]ORG!$A:$C,3,FALSE), E22),\"\")","v":""},{"$f":"IF(G22<=0,\" \",VLOOKUP(G22,[1]Accounts!$A:$B,2,FALSE))","v":" "}]
[null,null,null,null,{"$f":"_xlfn.IFNA(IFERROR(VLOOKUP($D23,[1]FUND1!$A:$C,3,FALSE),VLOOKUP($D23,[1]FUND1!$A:$C,3,FALSE)),\"\")","v":""},null,null,{"$f":"_xlfn.IFNA(IF(E23=\"ORG\",VLOOKUP(F23,[1]ORG!$A:$C,3,FALSE), E23),\"\")","v":""},{"$f":"IF(G23<=0,\" \",VLOOKUP(G23,[1]Accounts!$A:$B,2,FALSE))","v":" "}]
[null,null,null,null,{"$f":"_xlfn.IFNA(IFERROR(VLOOKUP($D24,[1]FUND1!$A:$C,3,FALSE),VLOOKUP($D24,[1]FUND1!$A:$C,3,FALSE)),\"\")","v":""},null,null,{"$f":"_xlfn.IFNA(IF(E24=\"ORG\",VLOOKUP(F24,[1]ORG!$A:$C,3,FALSE), E24),\"\")","v":""},{"$f":"IF(G24<=0,\" \",VLOOKUP(G24,[1]Accounts!$A:$B,2,FALSE))","v":" "}]
[null,null,null,null,{"$f":"_xlfn.IFNA(IFERROR(VLOOKUP($D25,[1]FUND1!$A:$C,3,FALSE),VLOOKUP($D25,[1]FUND1!$A:$C,3,FALSE)),\"\")","v":""},null,null,{"$f":"_xlfn.IFNA(IF(E25=\"ORG\",VLOOKUP(F25,[1]ORG!$A:$C,3,FALSE), E25),\"\")","v":""},{"$f":"IF(G25<=0,\" \",VLOOKUP(G25,[1]Accounts!$A:$B,2,FALSE))","v":" "}]
[null,null,null,null,{"$f":"_xlfn.IFNA(IFERROR(VLOOKUP($D26,[1]FUND1!$A:$C,3,FALSE),VLOOKUP($D26,[1]FUND1!$A:$C,3,FALSE)),\"\")","v":""},null,null,{"$f":"_xlfn.IFNA(IF(E26=\"ORG\",VLOOKUP(F26,[1]ORG!$A:$C,3,FALSE), E26),\"\")","v":""},{"$f":"IF(G26<=0,\" \",VLOOKUP(G26,[1]Accounts!$A:$B,2,FALSE))","v":" "}]
[null,null,null,null,{"$f":"_xlfn.IFNA(IFERROR(VLOOKUP($D27,[1]FUND1!$A:$C,3,FALSE),VLOOKUP($D27,[1]FUND1!$A:$C,3,FALSE)),\"\")","v":""},null,null,{"$f":"_xlfn.IFNA(IF(E27=\"ORG\",VLOOKUP(F27,[1]ORG!$A:$C,3,FALSE), E27),\"\")","v":""},{"$f":"IF(G27<=0,\" \",VLOOKUP(G27,[1]Accounts!$A:$B,2,FALSE))","v":" "}]
[null,null,null,null,{"$f":"_xlfn.IFNA(IFERROR(VLOOKUP($D28,[1]FUND1!$A:$C,3,FALSE),VLOOKUP($D28,[1]FUND1!$A:$C,3,FALSE)),\"\")","v":""},null,null,{"$f":"_xlfn.IFNA(IF(E28=\"ORG\",VLOOKUP(F28,[1]ORG!$A:$C,3,FALSE), E28),\"\")","v":""},{"$f":"IF(G28<=0,\" \",VLOOKUP(G28,[1]Accounts!$A:$B,2,FALSE))","v":" "}]
[null,null,null,null,{"$f":"_xlfn.IFNA(IFERROR(VLOOKUP($D29,[1]FUND1!$A:$C,3,FALSE),VLOOKUP($D29,[1]FUND1!$A:$C,3,FALSE)),\"\")","v":""},null,null,{"$f":"_xlfn.IFNA(IF(E29=\"ORG\",VLOOKUP(F29,[1]ORG!$A:$C,3,FALSE), E29),\"\")","v":""},{"$f":"IF(G29<=0,\" \",VLOOKUP(G29,[1]Accounts!$A:$B,2,FALSE))","v":" "}]
[null,null,null,null,{"$f":"_xlfn.IFNA(IFERROR(VLOOKUP($D30,[1]FUND1!$A:$C,3,FALSE),VLOOKUP($D30,[1]FUND1!$A:$C,3,FALSE)),\"\")","v":""},null,null,{"$f":"_xlfn.IFNA(IF(E30=\"ORG\",VLOOKUP(F30,[1]ORG!$A:$C,3,FALSE), E30),\"\")","v":""},{"$f":"IF(G30<=0,\" \",VLOOKUP(G30,[1]Accounts!$A:$B,2,FALSE))","v":" "}]
[null,null,null,null,{"$f":"_xlfn.IFNA(IFERROR(VLOOKUP($D31,[1]FUND1!$A:$C,3,FALSE),VLOOKUP($D31,[1]FUND1!$A:$C,3,FALSE)),\"\")","v":""},null,null,{"$f":"_xlfn.IFNA(IF(E31=\"ORG\",VLOOKUP(F31,[1]ORG!$A:$C,3,FALSE), E31),\"\")","v":""},{"$f":"IF(G31<=0,\" \",VLOOKUP(G31,[1]Accounts!$A:$B,2,FALSE))","v":" "}]
[null,null,null,null,{"$f":"_xlfn.IFNA(IFERROR(VLOOKUP($D32,[1]FUND1!$A:$C,3,FALSE),VLOOKUP($D32,[1]FUND1!$A:$C,3,FALSE)),\"\")","v":""},null,null,{"$f":"_xlfn.IFNA(IF(E32=\"ORG\",VLOOKUP(F32,[1]ORG!$A:$C,3,FALSE), E32),\"\")","v":""},{"$f":"IF(G32<=0,\" \",VLOOKUP(G32,[1]Accounts!$A:$B,2,FALSE))","v":" "}]
[null,null,null,null,{"$f":"_xlfn.IFNA(IFERROR(VLOOKUP($D33,[1]FUND1!$A:$C,3,FALSE),VLOOKUP($D33,[1]FUND1!$A:$C,3,FALSE)),\"\")","v":""},null,null,{"$f":"_xlfn.IFNA(IF(E33=\"ORG\",VLOOKUP(F33,[1]ORG!$A:$C,3,FALSE), E33),\"\")","v":""},{"$f":"IF(G33<=0,\" \",VLOOKUP(G33,[1]Accounts!$A:$B,2,FALSE))","v":" "}]
[null,null,null,null,{"$f":"_xlfn.IFNA(IFERROR(VLOOKUP($D34,[1]FUND1!$A:$C,3,FALSE),VLOOKUP($D34,[1]FUND1!$A:$C,3,FALSE)),\"\")","v":""},null,null,{"$f":"_xlfn.IFNA(IF(E34=\"ORG\",VLOOKUP(F34,[1]ORG!$A:$C,3,FALSE), E34),\"\")","v":""},{"$f":"IF(G34<=0,\" \",VLOOKUP(G34,[1]Accounts!$A:$B,2,FALSE))","v":" "}]
[null,null,null,null,{"$f":"_xlfn.IFNA(IFERROR(VLOOKUP($D35,[1]FUND1!$A:$C,3,FALSE),VLOOKUP($D35,[1]FUND1!$A:$C,3,FALSE)),\"\")","v":""},null,null,{"$f":"_xlfn.IFNA(IF(E35=\"ORG\",VLOOKUP(F35,[1]ORG!$A:$C,3,FALSE), E35),\"\")","v":""},{"$f":"IF(G35<=0,\" \",VLOOKUP(G35,[1]Accounts!$A:$B,2,FALSE))","v":" "}]
[null,null,null,null,{"$f":"_xlfn.IFNA(IFERROR(VLOOKUP($D36,[1]FUND1!$A:$C,3,FALSE),VLOOKUP($D36,[1]FUND1!$A:$C,3,FALSE)),\"\")","v":""},null,null,{"$f":"_xlfn.IFNA(IF(E36=\"ORG\",VLOOKUP(F36,[1]ORG!$A:$C,3,FALSE), E36),\"\")","v":""},{"$f":"IF(G36<=0,\" \",VLOOKUP(G36,[1]Accounts!$A:$B,2,FALSE))","v":" "}]
[null,null,null,null,{"$f":"_xlfn.IFNA(IFERROR(VLOOKUP($D37,[1]FUND1!$A:$C,3,FALSE),VLOOKUP($D37,[1]FUND1!$A:$C,3,FALSE)),\"\")","v":""},null,null,{"$f":"_xlfn.IFNA(IF(E37=\"ORG\",VLOOKUP(F37,[1]ORG!$A:$C,3,FALSE), E37),\"\")","v":""},{"$f":"IF(G37<=0,\" \",VLOOKUP(G37,[1]Accounts!$A:$B,2,FALSE))","v":" "}]
[null,null,null,null,{"$f":"_xlfn.IFNA(IFERROR(VLOOKUP($D38,[1]FUND1!$A:$C,3,FALSE),VLOOKUP($D38,[1]FUND1!$A:$C,3,FALSE)),\"\")","v":""},null,null,{"$f":"_xlfn.IFNA(IF(E38=\"ORG\",VLOOKUP(F38,[1]ORG!$A:$C,3,FALSE), E38),\"\")","v":""},{"$f":"IF(G38<=0,\" \",VLOOKUP(G38,[1]Accounts!$A:$B,2,FALSE))","v":" "}]
[null,null,null,null,{"$f":"_xlfn.IFNA(IFERROR(VLOOKUP($D39,[1]FUND1!$A:$C,3,FALSE),VLOOKUP($D39,[1]FUND1!$A:$C,3,FALSE)),\"\")","v":""},null,null,{"$f":"_xlfn.IFNA(IF(E39=\"ORG\",VLOOKUP(F39,[1]ORG!$A:$C,3,FALSE), E39),\"\")","v":""},{"$f":"IF(G39<=0,\" \",VLOOKUP(G39,[1]Accounts!$A:$B,2,FALSE))","v":" "}]
[null,null,null,null,{"$f":"_xlfn.IFNA(IFERROR(VLOOKUP($D40,[1]FUND1!$A:$C,3,FALSE),VLOOKUP($D40,[1]FUND1!$A:$C,3,FALSE)),\"\")","v":""},null,null,{"$f":"_xlfn.IFNA(IF(E40=\"ORG\",VLOOKUP(F40,[1]ORG!$A:$C,3,FALSE), E40),\"\")","v":""},{"$f":"IF(G40<=0,\" \",VLOOKUP(G40,[1]Accounts!$A:$B,2,FALSE))","v":" "}]
{"$rows_left_out":42}
{"sheet":"FUND","index":1,"n_rows":1904,"n_cols":19,"rows_kept":1904,"cut":false,"hidden":true,"merged":[[0,5,1,5],[0,0,1,0],[0,1,1,1],[0,2,1,2],[0,3,1,3],[0,4,1,4],[0,18,1,18],[0,7,1,7],[0,10,1,10],[0,11,1,11],[0,12,1,12],[0,15,1,15],[0,17,1,17]]}
["TYPE LVL1","TYPE LVL2","FUND LVL1","FUND LVL2","FUND LVL3","FUND LVL4","FUND","DESCRIPTION","DATA","CNTL","CMB","STATUS","EFF DATE","TERM","NEXT CHANGE","MANAGER ID","FUND","DEFAULT ORGN","DEFAULT PROG"]
[null,null,null,null,null,null,"LVL5",null,"ENTRY","FUND",null,null,null,"DATE","DATE",null,"MANAGER"]
[null,"1A",100,null,null,null,null,"Regular Operating Fund","N",null,null,"A","2009-04-01",null,"2099-12-31"]
[null,null,null,1000,null,null,null,"Regular Operating Fund","N",null,null,"A","2009-04-01",null,"2099-12-31"]
[null,null,null,null,10000,null,null,"Regular Operating Fund","N",null,null,"A","2009-04-01",null,"2099-12-31"]
[null,null,null,null,null,100000,null,"Regular Operating Fund","Y",null,null,"A","2009-04-01",null,"2099-12-31",null,null,null,"ORG"]
[null,null,null,null,null,100015,null,"Operating Transfers to IFR","Y",null,null,"A","2014-04-01",null,"2099-12-31",100477674,"Elliott, Craig",null,10]
[null,null,110,null,null,null,null,"Cost Recovery","N",null,null,"A","2009-04-01",null,"2099-12-31"]
[null,null,null,1100,null,null,null,"Cost Recovery","N",null,null,"A","2009-04-01",null,"2099-12-31"]
[null,null,null,null,11000,null,null,"Cost Recovery","N",null,null,"A","2009-04-01",null,"2099-12-31"]
[null,null,null,null,null,110000,null,"Cost Recovery","Y",null,null,"A","2009-04-01",null,"2099-12-31",null,null,null,"ORG"]
[null,null,120,null,null,null,null,"Purchased Services","N",null,null,"A","2009-04-01",null,"2099-12-31"]
[null,null,null,1200,null,null,null,"Purchased Services","N",null,null,"A","2009-04-01",null,"2099-12-31"]
[null,null,null,null,12000,null,null,"Purchased Services","N",null,null,"A","2009-04-01",null,"2099-12-31"]
[null,null,null,null,null,120000,null,"Purchased Services","Y",null,null,"A","2009-04-01",null,"2099-12-31",null,null,null,"ORG"]
[null,null,null,null,null,125000,null,"Purchased Services - UOIT Specific","Y",null,null,"A","2011-04-01",null,"2099-12-31",null,null,null,"ORG"]
[null,null,130,null,null,null,null,"Revenue Units","N",null,null,"A","2009-04-01",null,"2099-12-31"]
[null,null,null,1300,null,null,null,"Revenue Units","N",null,null,"A","2009-04-01",null,"2099-12-31"]
[null,null,null,null,13000,null,null,"Revenue Units","N",null,null,"A","2009-04-01",null,"2099-12-31"]
[null,null,null,null,null,130000,null,"Management Development Centre -FBIT","Y",null,null,"A","2009-04-01",null,"2099-12-31",100377890,"Ritchie, Pamela",2200,10]
[null,null,null,null,null,130010,null,"Stores","Y",null,null,"A","2014-07-30",null,"2099-12-31",100550653,"Crawford, Gregory",2700,10]
[null,null,null,null,null,130020,null,"Additional Qualification -FEd","Y",null,null,"A","2009-04-01",null,"2099-12-31",null,null,2400,10]
[null,null,null,null,null,130021,null,"Crime Scene Camp (Forensics Camp)","Y",null,null,"A","2013-04-29",null,"2099-12-31",100246238,"Holdway, Douglas",2700,10]
[null,null,null,null,null,130022,null,"Education Camps","Y",null,null,"A","2014-05-01",null,"2099-12-31",null,null,2400,10]
[null,null,null,null,null,130030,null,"SEM","Y",null,null,"A","2014-04-04",null,"2099-12-31",100372919,"Owen, Michael",3200,11]
[null,null,null,null,null,130040,null,"UOIT Retail Store","Y",null,null,"A","2014-08-21",null,"2099-12-31",100513776,"McGovern, Susan",null,16]
[null,null,null,null,null,130050,null,"Social Research Centre","Y",null,null,"A","2014-10-24",null,"2099-12-31",100339617,"Ammar, Nawal",2300,10]
[null,null,140,null,null,null,null,"Unrestricted - Capital","N",null,null,"A","2009-04-01",null,"2099-12-31"]
[null,null,null,1400,null,null,null,"Capital Asset ","N",null,null,"A","2009-04-01",null,"2099-12-31"]
[null,null,null,null,14000,null,null,"Capital Asset","N",null,null,"A","2009-04-01",null,"2099-12-31"]
[null,null,null,null,null,140000,null,"Capital Asset","Y",null,null,"A","2009-04-01",null,"2099-12-31",null,null,null,22]
[null,"1B",190,null,null,null,null,"IR - Expendable","N",null,null,"A","2009-04-01",null,"2099-12-31"]
[null,null,null,1900,null,null,null,"IR - Expendable General Funds","N",null,null,"A","2009-04-01",null,"2099-12-31"]
[null,null,null,null,19000,null,null,"Expendable General","N",null,null,"A","2009-04-01",null,"2099-12-31"]
[null,null,null,null,null,"1900 A",null,"Advancement General","Y",null,null,"A","2009-04-01",null,"2099-12-31",100227584,"Waugh, Clive",null,30]
[null,null,null,null,null,190000,null,"Highest Priority Unrestricted","Y",null,null,"A","2010-04-28",null,"2099-12-31",100227584,"Waugh, Clive",null,30]
[null,null,null,null,null,190001,null,"Debenture","Y",null,null,"A","2009-04-01",null,"2099-12-31",100227584,"Waugh, Clive",null,30]
[null,null,null,null,null,190002,null,"Designated Capital Fund","Y",null,null,"A","2009-04-01",null,"2099-12-31",100227584,"Waugh, Clive",null,30]
[null,null,null,null,null,190003,null,"Expendable Research","Y",null,null,"A","2009-04-01",null,"2099-12-31",100227584,"Waugh, Clive",null,30]
[null,null,null,null,null,190004,null,"Registration Fees","Y",null,null,"A","2009-04-01",null,"2099-12-31",100227584,"Waugh, Clive",null,30]
{"$rows_left_out":1865}
{"sheet":"ORGN","index":2,"n_rows":277,"n_cols":20,"rows_kept":277,"cut":false,"hidden":true,"merged":[[7,11,7,12],[8,11,8,12],[9,11,9,12],[10,11,10,12],[11,11,11,12],[12,11,12,12],[0,0,0,19],[1,11,2,11],[19,11,19,12],[6,11,6,12],[5,11,5,12],[4,11,4,12],[3,11,3,12],[20,11,20,12],[21,11,21,12],[22,11,22,12],[23,11,23,12],[24,11,24,12],[13,11,13,12],[14,11,14,12],[15,11,15,12],[16,11,16,12],[17,11,17,12],[18,11,18,12],[31,11,31,12],[32,11,32,12],[33,11,33,12],[34,11,34,12],[35,11,35,12],[36,11,36,12],[25,11,25,12],[26,11,26,12],[27,11,27,12],[28,11,28,12],[29,11,29,12],[30,11,30,12],[43,11,43,12],[44,11,44,12],[45,11,45,12],[46,11,46,12],[47,11,47,12],[48,11,48,12],[37,11,37,12],[38,11,38,12],[39,11,39,12],[40,11,40,12],[41,11,41,12],[42,11,42,12],[55,11,55,12],[56,11,56,12],[57,11,57,12],[58,11,58,12],[59,11,59,12],[60,11,60,12],[49,11,49,12],[50,11,50,12],[51,11,51,12],[52,11,52,12],[53,11,53,12],[54,11,54,12],[67,11,67,12],[68,11,68,12],[69,11,69,12],[70,11,70,12],[71,11,71,12],[72,11,72,12],[61,11,61,12],[62,11,62,12],[63,11,63,12],[64,11,64,12],[65,11,65,12],[66,11,66,12],[79,11,79,12],[80,11,80,12],[81,11,81,12],[82,11,82,12],[83,11,83,12],[84,11,84,12],[73,11,73,12],[74,11,74,12],[75,11,75,12],[76,11,76,12],[77,11,77,12],[78,11,78,12],[91,11,91,12],[92,11,92,12],[93,11,93,12],[94,11,94,12],[95,11,95,12],[96,11,96,12],[85,11,85,12],[86,11,86,12],[87,11,87,12],[88,11,88,12],[89,11,89,12],[90,11,90,12],[103,11,103,12],[104,11,104,12],[105,11,105,12],[106,11,106,12],[107,11,107,12],[108,11,108,12],[97,11,97,12],[98,11,98,12],[99,11,99,12],[100,11,100,12],[101,11,101,12],[102,11,102,12],[115,11,115,12],[116,11,116,12],[117,11,117,12],[118,11,118,12],[119,11,119,12],[120,11,120,12],[109,11,109,12],[110,11,110,12],[111,11,111,12],[112,11,112,12],[113,11,113,12],[114,11,114,12],[127,11,127,12],[128,11,128,12],[129,11,129,12],[130,11,130,12],[131,11,131,12],[132,11,132,12],[121,11,121,12],[122,11,122,12],[123,11,123,12],[124,11,124,12],[125,11,125,12],[126,11,126,12],[139,11,139,12],[140,11,140,12],[141,11,141,12],[142,11,142,12],[143,11,143,12],[144,11,144,12],[133,11,133,12],[134,11,134,12],[135,11,135,12],[136,11,136,12],[137,11,137,12],[138,11,138,12],[151,11,151,12],[152,11,152,12],[153,11,153,12],[154,11,154,12],[155,11,155,12],[156,11,156,12],[145,11,145,12],[146,11,146,12],[147,11,147,12],[148,11,148,12],[149,11,149,12],[150,11,150,12],[163,11,163,12],[164,11,164,12],[165,11,165,12],[166,11,166,12],[167,11,167,12],[168,11,168,12],[157,11,157,12],[158,11,158,12],[159,11,159,12],[160,11,160,12],[161,11,161,12],[162,11,162,12],[175,11,175,12],[176,11,176,12],[177,11,177,12],[178,11,178,12],[179,11,179,12],[180,11,180,12],[169,11,169,12],[170,11,170,12],[171,11,171,12],[172,11,172,12],[173,11,173,12],[174,11,174,12],[187,11,187,12],[188,11,188,12],[189,11,189,12],[190,11,190,12],[191,11,191,12],[192,11,192,12],[181,11,181,12],[182,11,182,12],[183,11,183,12],[184,11,184,12],[185,11,185,12],[186,11,186,12],[199,11,199,12],[200,11,200,12],[201,11,201,12],[202,11,202,12],[203,11,203,12],[204,11,204,12],[193,11,193,12],[194,11,194,12],[195,11,195,12],[196,11,196,12],[197,11,197,12],[198,11,198,12],[211,11,211,12],[212,11,212,12],[213,11,213,12],[214,11,214,12],[215,11,215,12],[216,11,216,12],[205,11,205,12],[206,11,206,12],[207,11,207,12],[208,11,208,12],[209,11,209,12],[210,11,210,12],[223,11,223,12],[224,11,224,12],[225,11,225,12],[226,11,226,12],[227,11,227,12],[228,11,228,12],[217,11,217,12],[218,11,218,12],[219,11,219,12],[220,11,220,12],[221,11,221,12],[222,11,222,12],[238,11,238,12],[239,11,239,12],[240,11,240,12],[229,11,229,12],[230,11,230,12],[231,11,231,12],[232,11,232,12],[233,11,233,12],[234,11,234,12],[235,11,235,12],[236,11,236,12],[237,11,237,12],[270,11,270,12],[259,11,259,12],[260,11,260,12],[261,11,261,12],[262,11,262,12],[263,11,263,12],[264,11,264,12],[253,11,253,12],[254,11,254,12],[255,11,255,12],[256,11,256,12],[257,11,257,12],[258,11,258,12],[265,11,265,12],[266,11,266,12],[267,11,267,12],[268,11,268,12],[269,11,269,12],[247,11,247,12],[248,11,248,12],[249,11,249,12],[250,11,250,12],[251,11,251,12],[252,11,252,12],[241,11,241,12],[242,11,242,12],[243,11,243,12],[244,11,244,12],[245,11,245,12],[246,11,246,12]]}
["Organization Hierarchy"]
["Orgn Lvl1","Orgn Lvl2","Orgn Lvl3","Orgn","Orgn","Orgn","Orgn","Orgn","DESCRIPTION","DATA","STATUS","Default Prog.",null,"CNTL","CMB","EFF.","TERM.","NEXT CHANGE","MANAGER ID","MANAGER"]
[null,null,null,"Lvl4","Lvl5","Lvl6","Lvl7","Lvl8",null,"ENTRY",null,null,null,"ORGN",null,"DATE","DATE","DATE",null,"NAME"]
[0,null,null,null,null,null,null,null,"ORG FOR BALANCE SHEET ACC PURCHASES","Y","A",null,null,null,"N","2010-04-01",null,"2099-12-31"]
["UOIT",null,null,null,null,null,null,null,"UOIT","N","A",null,null,null,null,"2009-04-01",null,"2099-12-31"]
[null,"1A",null,null,null,null,null,null,"Administrative Services","N","A",null,null,null,null,"2009-04-01",null,"2099-12-31"]
[null,null,11,null,null,null,null,null,"Office of the President","N","A",null,null,null,null,"2013-08-27",null,"2099-12-31",100469874,"McTiernan, Tim"]
[null,null,null,110,null,null,null,null,"Office of the President","N","A",null,null,null,null,"2013-08-27",null,"2099-12-31",100469874,"McTiernan, Tim"]
[null,null,null,null,1100,null,null,null,"Board of Governors","Y","A",15,null,null,null,"2013-07-26",null,"2099-12-31",100469874,"McTiernan, Tim"]
[null,null,null,null,1101,null,null,null,"Presidents Office","Y","A",15,null,null,null,"2013-07-25",null,"2099-12-31",100469874,"McTiernan, Tim"]
[null,null,null,null,1102,null,null,null,"Secretariate","Y","A",15,null,null,null,"2013-04-01",null,"2099-12-31"]
[null,null,12,null,null,null,null,null,"VP Finance","N","A",null,null,null,null,"2013-08-27",null,"2099-12-31",100477674,"Elliott, Craig"]
[null,null,null,120,null,null,null,null,"VP Finance","N","A",null,null,null,null,"2013-01-22",null,"2099-12-31",100477674,"Elliott, Craig"]
[null,null,null,null,1200,null,null,null,"Finance & Admin - VP","Y","A",15,null,null,null,"2013-04-26",null,"2099-12-31",100477674,"Elliott, Craig"]
[null,null,null,null,1201,null,null,null,"Re-Engineering","Y","A",15,null,null,null,"2013-01-22",null,"2099-12-31",100477674,"Elliott, Craig"]
[null,null,null,null,1202,null,null,null,"Central Administration","Y","A",15,null,null,null,"2013-07-25",null,"2099-12-31",100477674,"Elliott, Craig"]
[null,null,null,null,1203,null,null,null,"Employee Benefit Cost Recov FTE45D","Y","A",15,null,null,null,"2013-08-27",null,"2099-12-31",100477674,"Elliott, Craig"]
[null,null,null,null,1204,null,null,null,"Employee Benefit Recovery PTZDU","Y","A",15,null,null,null,"2013-08-27",null,"2099-12-31",100477674,"Elliott, Craig"]
[null,null,null,null,1205,null,null,null,"Employee Costs Non-Recovery","Y","A",15,null,null,null,"2013-08-27",null,"2099-12-31",100477674,"Elliott, Craig"]
[null,null,null,null,1206,null,null,null,"Cultureworksn - CLosed to BS","Y","I",15,null,null,null,"2012-03-13",null,"2099-12-31",100350386,"Milovick, Matt"]
[null,null,null,null,1207,null,null,null,"Risk Management","Y","A",15,null,null,null,"2013-01-22",null,"2099-12-31",100477674,"Elliott, Craig"]
[null,null,null,null,1208,null,null,{"$f":"IF(E22=\"ORG\",VLOOKUP(F22,ORGN!A:T,8), E22)","v":1208},"Campus Safety","Y","A",22,null,null,null,"2013-08-27",null,"2099-12-31",100477674,"Elliott, Craig"]
[null,null,null,null,1209,null,null,null,"Cost Recovery - Anomalies","Y","A",15,null,null,null,"2013-08-27",null,"2099-12-31",100477674,"Elliott, Craig"]
[null,null,null,null,1210,null,null,null,"CAF20504 - Feasibility Study","Y","A",15,null,null,null,"2013-08-27",null,"2099-12-31",100477674,"Elliott, Craig"]
[null,null,null,null,1211,null,null,null,"Women's Campus Safety","Y","A",15,null,null,null,"2014-04-29",null,"2099-12-31",100477674,"Elliott, Craig"]
[null,null,null,null,"AAA",null,null,null,"P&L ORGs to BS - CLOSED","Y","I",15,null,null,null,"2010-11-09",null,"2099-12-31",100350386,"Milovick, Matt"]
[null,null,null,122,null,null,null,null,"Executive Finance","N","A",null,null,null,null,"2013-08-27",null,"2099-12-31",100477674,"Elliott, Craig"]
[null,null,null,null,1220,null,null,null,"Finance & Admin-Execu Dir- Closed","Y","I",15,null,null,null,"2012-05-08",null,"2099-12-31",100329866,"Rigby, Judy"]
[null,null,null,null,1221,null,null,null,"Finance & Admin-Research","Y","A",15,null,null,null,"2013-07-25",null,"2099-12-31",100477674,"Elliott, Craig"]
[null,null,null,null,1222,null,null,null,"Business Operations","Y","A",15,null,null,null,"2013-07-25",null,"2099-12-31",100477674,"Elliott, Craig"]
[null,null,null,null,1223,null,null,null,"Financial Planning & Reporting","Y","A",15,null,null,null,"2013-07-25",null,"2099-12-31",100477674,"Elliott, Craig"]
[null,null,null,null,1224,null,null,null,"Payroll","Y","A",15,null,null,null,"2013-04-01",null,"2099-12-31",100477674,"Elliott, Craig"]
[null,null,null,128,null,null,null,null,"Ancillary Operations","N","A",null,null,null,null,"2013-08-27",null,"2099-12-31",100477674,"Elliott, Craig"]
[null,null,null,null,1280,null,null,null,"Bookstore","Y","A",18,null,null,null,"2013-08-27",null,"2099-12-31",100477674,"Elliott, Craig"]
[null,null,null,null,1281,null,null,null,"Parking","Y","A",18,null,null,null,"2013-08-27",null,"2099-12-31",100477674,"Elliott, Craig"]
[null,null,null,null,1282,null,null,null,"Food Services","Y","A",18,null,null,null,"2013-08-27",null,"2099-12-31",100477674,"Elliott, Craig"]
[null,null,null,null,1283,null,null,null,"Conference Centre","Y","A",18,null,null,null,"2013-08-27",null,"2099-12-31",100477674,"Elliott, Craig"]
[null,null,13,null,null,null,null,null,"VP External Relations - Admin","N","A",null,null,null,null,"2010-04-15",null,"2099-12-31",100045651,"West-Moynes, Marylynn"]
[null,null,null,130,null,null,null,null,"External Relations","N","A",null,null,null,null,"2010-04-15",null,"2099-12-31",100045651,"West-Moynes, Marylynn"]
[null,null,null,null,1300,null,null,null,"External Relations","Y","A",16,null,null,null,"2013-07-25",null,"2099-12-31",100513776,"McGovern, Susan"]
{"$rows_left_out":237}